• Message: Error: Initialize scatter file failed. Please check the scatter file name you load is legal. Meaning: SP Flash tool doesn't accept the name format of your scatter file.
  • This command doesn’t work at all, it says make: *** No rule to make target 'test_person_detection_test'. Stop. and the right target actually is test_person_detection_test_int8 as it used to be when it was an experimental version.
  • (unknown error: DevToolsActivePort file doesn't exist) (The process started from chrome location /usr/bin/google-chrome is no longer running, so ChromeDriver is assuming that Chrome has crashed.) During handling of the above exception, another exception occurred:
  • Selenium::WebDriver::Error::UnknownError: unknown error: Chrome failed to start: exited abnormally (unknown error: DevToolsActivePort file doesn't exist) (The process started from chrome location /usr/bin/google-chrome is no longer running, so ChromeDriver is assuming that Chrome has crashed.) (Driver info: chromedriver= 2.45.615279 (12 ...
  • selenium WebDriverException: Message: unknown error: DevToolsActivePort file doesnt exist 在centos中使用无头chrome报以下错误 selenium.common.exceptions.WebDriverException: Message: unknown error: DevToolsActivePort file doesn 't exist
  • Selenium::WebDriver::Error::UnknownError: unknown error: Chrome failed to start: crashed (unknown error: DevToolsActivePort file doesn't exist) (The process started from chrome location /usr/bin/google-chrome is no longer running, so ChromeDriver is assuming that Chrome has crashed.) #0 0x7f87e934a7a9 <unknown>
CircleCI 上での System Spec (RSpec) が unknown error: DevToolsActivePort file doesn't exist と怒られて失敗する場合 プログラミング -> Ruby on Rails 結論 Headless Chrome の設定の箇所において、options で no-sandbox を指定しましょう。
解决centos7下 selenium报错--unknown error&colon; DevToolsActivePort file doesn&&num;39&semi;t exist. 解决centos7下 selenium报错--unknown error: DevToolsActivePort file doesn't exist 早上在linux下用selenium启动Chro ...
“DevToolsActivePort file doesn't exist” error in Jenkins [duplicate , WebDriverException: unknown error: DevToolsActivePort file doesn't exist implies that the ChromeDriver was unable to initiate/spawn a new WebBrowser i.e. Selenium error: Chrome failed to start: exited abnormally Filed under Fixes , Linux When I launched Selenium tests In Jenkins with Maven on CentOS 7 I got: unknown error: Chrome failed to start: exited abnormally (unknown error: DevToolsActivePort file doesn’t exist ... (unknown error: DevToolsActivePort file doesn't exist) (The process started from chrome location /usr/lib/chromium-browser/chromium-browser is no longer running, so ChromeDriver is assuming that...
(unknown error: DevToolsActivePort file doesn't exist) (The process started from chrome location /usr/bin/google-chrome-stable is no longer running, so ChromeDriver is assuming that Chrome has crashed.)
File exceeds the maximum file size: OneDrive can't sync files over 100GB. Remove these files from the folder you want to protect and then try again. The file name isn't allowed in OneDrive: File names can't start with a space or include any of these characters: \ : / * ? < > " |. Please move or rename the file to continue. (unknown error: DevToolsActivePort file doesn't exist) (The process started from chrome location /usr/bin/google-chrome is no longer running, so ChromeDriver is assuming that Chrome has crashed.) 댓글 메뉴 보기
При запуске под админом, последовательно: - Unknown error or drive not exist - PORTTALK Error. Invalid driver handle - PortTalk driver not installed!Спасибо за ваш ответ на Stack Overflow на русском! Пожалуйста, убедитесь, что публикуемое сообщение отвечает на поставленный вопрос.

Klwp map api

Vida hair growth instagram

Case 1845c hydraulic control valve

Traverse city news

Montgomery ward freezer manual